List:MySQL++« Previous MessageNext Message »
From:George13p Date:March 27 2006 3:23pm
Subject: Re: problem with building mysql++
View as plain text  
hi!

when try building mysql++ 2.1.0
I get this msg many times:

./query.h:607: error: ‘con’ was not declared in this scope

when try building mysql++ 2.0.7:


linux:~/mysql++/mysql++-2.0.7 # make
make  all-recursive
make[1]: Entering directory `/root/mysql++/mysql++-2.0.7'
Making all in lib
make[2]: Entering directory `/root/mysql++/mysql++-2.0.7/lib'
/bin/sh ../libtool --mode=link g++ -pthread -g -O2  -L/usr/lib/mysql -o libmysqlpp.la
-rpath /usr/local/lib -version-info 2:7:0 coldata.lo connection.lo datetime.lo fields.lo
field_names.lo field_types.lo manip.lo myset.lo qparms.lo query.lo result.lo row.lo
sql_string.lo string_util.lo type_info.lo vallist.lo  -lz -lmysqlclient_r
grep: /usr/lib/mysql/libz.la: No such file or directory
/usr/bin/sed: can't read /usr/lib/mysql/libz.la: No such file or directory
libtool: link: `/usr/lib/mysql/libz.la' is not a valid libtool archive
make[2]: *** [libmysqlpp.la] Error 1
make[2]: Leaving directory `/root/mysql++/mysql++-2.0.7/lib'
make[1]: *** [all-recursive] Error 1
make[1]: Leaving directory `/root/mysql++/mysql++-2.0.7'
make: *** [all] Error 2



any idea to deal with??

thanks!




		
---------------------------------
New Yahoo! Messenger with Voice. Call regular phones from your PC for low, low rates.
Thread
Re: problem with building mysql++George13p27 Mar