List:General Discussion« Previous MessageNext Message »
From:Nick Edwards Date:June 9 2013 5:41am
Subject:severe build bug 5.5 viossl
View as plain text  
This was reported in 5.5.31, a patch, VERY SIMPLE was submitted.

The problem goes ignored by oracle

5.5.32 releases, same error, apply the same simple patch and builds

/tmp/mysql-5.5.32/vio/viossl.c: In function 'ssl_do':
/tmp/mysql-5.5.32/vio/viossl.c:175: error: 'SSL_OP_NO_COMPRESSION'
undeclared (first use in this
/tmp/mysql-5.5.32/vio/viossl.c:175: error: (Each undeclared identifier
is reported only once
/tmp/mysql-5.5.32/vio/viossl.c:175: error: for each function it appears in.)
make[2]: *** [vio/CMakeFiles/vio.dir/viossl.c.o] Error 1
make[1]: *** [vio/CMakeFiles/vio.dir/all] Error 2

Question, does anyone at oracle even bother with bug tracking now days?
How can something that causes a fail of building with versions of
openssl less then 1.0.0
go un fixed for so long.

Is this more proof that oracle DGAF about mysql?  should I move to mariadb?

because if we have to re patch a failed build on 5.5.33, we will I
think, since it shows oracle dont give a stuff

For list archive, patch is:

--- mysql-5.5.32/vio/viossl.c	2013-05-17 01:47:14.000000000 +1000
+++ mysql-5.5.32a/vio/viossl.c	2013-06-09 15:38:06.000000000 +1000
@@ -172,8 +172,10 @@
   SSL_SESSION_set_timeout(SSL_get_session(ssl), timeout);
   SSL_set_fd(ssl, vio->sd);
 #ifndef HAVE_YASSL
   SSL_set_options(ssl, SSL_OP_NO_COMPRESSION);

   if ((r= connect_accept_func(ssl)) < 1)
severe build bug 5.5 viosslNick Edwards9 Jun
  • Re: severe build bug 5.5 viosslClaudio Nanni9 Jun
    • Re: severe build bug 5.5 viosslNick Edwards9 Jun