MySQL Lists are EOL. Please join:

List:Internals« Previous MessageNext Message »
From:Sasha Pachev Date:June 1 2001 7:09pm
Subject:Re: latest snapshot build failures
View as plain text  
On Friday 01 June 2001 10:31, Colin Faber wrote:
> Hi guys, the latest snapshot of 4.0.0 failed again, Basic standard
> configuration, Here is the error:
> 
> gcc -DUNDEF_THREADS_HACK -DHAVE_CONFIG_H -I./../include -I./.. -I..   
> -O3 -DDBUG_OFF   -c complete.c
> complete.c: In function `filename_completion_function':
> complete.c:1465: syntax error before `*'
> complete.c:1479: `directory' undeclared (first use in this function)
> complete.c:1479: (Each undeclared identifier is reported only once
> complete.c:1479: for each function it appears in.)
> complete.c:1482: `DIR' undeclared (first use in this function)
> complete.c:1482: syntax error before `)'
> complete.c:1539: warning: assignment makes pointer from integer without
> a cast
> complete.c:1545: dereferencing pointer to incomplete type
> complete.c:1546: dereferencing pointer to incomplete type
> complete.c:1547: dereferencing pointer to incomplete type
> complete.c:1547: dereferencing pointer to incomplete type
> complete.c:1556: dereferencing pointer to incomplete type
> complete.c:1556: dereferencing pointer to incomplete type
> complete.c:1556: dereferencing pointer to incomplete type
> complete.c:1557: dereferencing pointer to incomplete type
> complete.c:1558: dereferencing pointer to incomplete type
> complete.c:1563: dereferencing pointer to incomplete type
> complete.c:1564: dereferencing pointer to incomplete type
> complete.c:1565: dereferencing pointer to incomplete type
> complete.c:1576: syntax error before `)'
> complete.c:1604: dereferencing pointer to incomplete type
> complete.c:1617: dereferencing pointer to incomplete type
> complete.c:1621: dereferencing pointer to incomplete type
> complete.c:1624: dereferencing pointer to incomplete type
> complete.c:1624: dereferencing pointer to incomplete type
> gmake[2]: *** [complete.o] Error 1
> gmake[2]: Leaving directory `/usr/local/src/mysql4.0.0/readline'
> gmake[1]: *** [all-recursive] Error 1
> gmake[1]: Leaving directory `/usr/local/src/mysql4.0.0'
> gmake: *** [all-recursive-am] Error 2

Every time you do a pull, I recommend you do BUILD/compile-pentium-debug ( or 
BUILD/compile-pentium if you want a fast binary). This will make sure you are 
doing a clean build. A lot of times we change things around in the Makefiles 
or in configure, so after a pull, simple make does not work anymore.

BUILD/compile-pentium-debug has just worked for me. After Monty's latest 
changes replication is broken, which I am about to investigate, but that is a 
different story.

-- 
MySQL Development Team
For technical support contracts, go to https://order.mysql.com/
   __  ___     ___ ____  __ 
  /  |/  /_ __/ __/ __ \/ /   Sasha Pachev <sasha@stripped>
 / /|_/ / // /\ \/ /_/ / /__  MySQL AB, http://www.mysql.com/
/_/  /_/\_, /___/\___\_\___/  Provo, Utah, USA
       <___/                  
Thread
latest snapshot build failuresColin Faber1 Jun
  • Re: latest snapshot build failuresSasha Pachev1 Jun