MySQL Lists are EOL. Please join:

List:Internals« Previous MessageNext Message »
From:Colin Faber Date:June 1 2001 4:31pm
Subject:latest snapshot build failures
View as plain text  
Hi guys, the latest snapshot of 4.0.0 failed again, Basic standard
configuration, Here is the error:

gcc -DUNDEF_THREADS_HACK -DHAVE_CONFIG_H -I./../include -I./.. -I..   
-O3 -DDBUG_OFF   -c complete.c
complete.c: In function `filename_completion_function':
complete.c:1465: syntax error before `*'
complete.c:1479: `directory' undeclared (first use in this function)
complete.c:1479: (Each undeclared identifier is reported only once
complete.c:1479: for each function it appears in.)
complete.c:1482: `DIR' undeclared (first use in this function)
complete.c:1482: syntax error before `)'
complete.c:1539: warning: assignment makes pointer from integer without
a cast
complete.c:1545: dereferencing pointer to incomplete type
complete.c:1546: dereferencing pointer to incomplete type
complete.c:1547: dereferencing pointer to incomplete type
complete.c:1547: dereferencing pointer to incomplete type
complete.c:1556: dereferencing pointer to incomplete type
complete.c:1556: dereferencing pointer to incomplete type
complete.c:1556: dereferencing pointer to incomplete type
complete.c:1557: dereferencing pointer to incomplete type
complete.c:1558: dereferencing pointer to incomplete type
complete.c:1563: dereferencing pointer to incomplete type
complete.c:1564: dereferencing pointer to incomplete type
complete.c:1565: dereferencing pointer to incomplete type
complete.c:1576: syntax error before `)'
complete.c:1604: dereferencing pointer to incomplete type
complete.c:1617: dereferencing pointer to incomplete type
complete.c:1621: dereferencing pointer to incomplete type
complete.c:1624: dereferencing pointer to incomplete type
complete.c:1624: dereferencing pointer to incomplete type
gmake[2]: *** [complete.o] Error 1
gmake[2]: Leaving directory `/usr/local/src/mysql4.0.0/readline'
gmake[1]: *** [all-recursive] Error 1
gmake[1]: Leaving directory `/usr/local/src/mysql4.0.0'
gmake: *** [all-recursive-am] Error 2
Thread
latest snapshot build failuresColin Faber1 Jun
  • Re: latest snapshot build failuresSasha Pachev1 Jun