List:MySQL++« Previous MessageNext Message »
From:Jason Toffaletti Date:August 23 2010 9:18pm
Subject:Re: mysql++ 3.1.0 upgrade issues
View as plain text  
>
> It's not immediately obvious to me why that would happen. Can you reproduce
> it by modifying one of the examples? I think maybe you're leaving out some
> detail to keep your code private -- fine by me -- so let's moveto a shared
> code base we can both look at.


I am working on distilling the code to something I can share. In the
process, it reminded me of another issue. I had to patch mysql++ 3.1.0 to
even get it to compile:

./ssx/genv2.cpp: In function 'bool generate_ssqls2(const char*, const
ParseV2*)':
./ssx/genv2.cpp:70: error: 'strcmp' was not declared in this scope
make[3]: *** [ssqlsxlat_genv2.o] Error 1
make[2]: *** [include/mysqlpp/mysqlpp.h] Error 2
make[1]: *** [CMakeFiles/libmysqlpp.dir/all] Error 2
make: *** [all] Error 2

Thread
mysql++ 3.1.0 upgrade issuesJason Toffaletti23 Aug
  • Re: mysql++ 3.1.0 upgrade issuesWarren Young23 Aug
Re: mysql++ 3.1.0 upgrade issuesJason Toffaletti23 Aug
  • Re: mysql++ 3.1.0 upgrade issuesWarren Young23 Aug
Re: mysql++ 3.1.0 upgrade issuesJason Toffaletti24 Aug
  • Re: mysql++ 3.1.0 upgrade issuesWarren Young24 Aug