List:MySQL++« Previous MessageNext Message »
From:Alex Luya Date:March 20 2009 1:52am
Subject:got another error after got another error
View as plain text  
Warren Young a écrit :
> Alex Luya wrote:
>>
>> ib/cmdline.cpp: In function `int getopt(int, char* const*, const 
>> char*)':
>> ib/cmdline.cpp:66: error: `ag_optind' was not declared in this scope
>> ib/cmdline.cpp:79: error: `gopts' was not declared in this scope
>> ib/cmdline.cpp:93: error: `ag_optind' was not declared in this scope
>> ib/cmdline.cpp:102: error: `ag_optind' was not declared in this scope
>
> Sorry about that.  This should be fixed now.  (svn MySQL++ did build 
> previously on Unixy platforms.)
> -------------------
new error
---------------------------------------

g++ -c -o mysqlpp_myset.o -g -mthreads -DUNICODE -D_UNICODE 
-DMYSQLPP_NO_DLL -DHAVE_MYSQL_SSL_SET -I"C:\Program Files\MySQL\MySQL 
Server 5.1\include"   -MTmysql
pp_myset.o -MFmysqlpp_myset.o.d -MD -MP lib/myset.cpp
g++ -c -o mysqlpp_mysql++.o -g -mthreads -DUNICODE -D_UNICODE 
-DMYSQLPP_NO_DLL -DHAVE_MYSQL_SSL_SET -I"C:\Program Files\MySQL\MySQL 
Server 5.1\include"   -MTmys
qlpp_mysql++.o -MFmysqlpp_mysql++.o.d -MD -MP lib/mysql++.cpp
lib/mysql++.cpp: In function `unsigned int mysqlpp::get_library_version()':
lib/mysql++.cpp:34: error: stray '@' in program
lib/mysql++.cpp:34: error: stray '@' in program
lib/mysql++.cpp:34: error: stray '@' in program
lib/mysql++.cpp:34: error: stray '@' in program
lib/mysql++.cpp:34: error: stray '@' in program
lib/mysql++.cpp:34: error: stray '@' in program
lib/mysql++.cpp:34: error: `MYSQLPP_VERSION_MAJOR' was not declared in 
this scope
lib/mysql++.cpp:34: error: `MYSQLPP_VERSION_MINOR' was not declared in 
this scope
lib/mysql++.cpp:34: error: `MYSQLPP_VERSION_BUGFIX' was not declared in 
this scope
mingw32-make: *** [mysqlpp_mysql++.o] Error 1
--------------------------------------------


> ------------------------------------------------------------------------
>
>
> No virus found in this incoming message.
> Checked by AVG - www.avg.com 
> Version: 8.5.278 / Virus Database: 270.11.19/2011 - Release Date: 03/19/09 07:05:00
>
>   


Thread
How to push NULL into template query?Alex Luya11 Mar
  • Re: How to push NULL into template query?Warren Young11 Mar
  • Re: How to push NULL into template query?Alex Luya13 Mar
    • How to construct a SQLQueryParms?Alex Luya13 Mar
    • Re: How to push NULL into template query?Warren Young13 Mar
      • How to ?Alex Luya17 Mar
        • How to build from svn r2483?Alex Luya17 Mar
        • Re: How to ?Warren Young17 Mar
          • Re: How to ?Many files does not exist or is incomplete or subfixedwith .inAlex Luya18 Mar
            • Re: How to ?Many files does not exist or is incomplete or subfixedwith .inWarren Young18 Mar
              • got another errorAlex Luya18 Mar
                • Re: got another errorWarren Young19 Mar
                  • got another error after got another errorAlex Luya20 Mar
                    • Re: got another error after got another errorWarren Young20 Mar
                      • Re: got another error after got another errorWarren Young21 Mar
              • Got all files from running ./bootstracp,but compile errorAlex Luya19 Mar