List:MySQL++« Previous MessageNext Message »
From:Kai Hartmann Date:April 26 2006 5:10pm
Subject:Problems building version 2.1.1
View as plain text  
Hi all,

I get the following error when trying to build from source:

In file included from custom1.cpp:29:
stock.h: In function `void populate_stock(stock*, const mysqlpp::Row&)
[with mysqlpp::sql_dummy_type dummy = sql_dummy]':
stock.h:47:   instantiated from here
stock.h:47: error: invalid static_cast from type `const
mysqlpp::ColData' to type `std::basic_string<char,
std::char_traits<char>, std::allocator<char> >'
make[1]: *** [custom1_custom1.o] Error 1
make[1]: Leaving directory `/home/kha/tmp/mysql++-2.1.1/examples'
make: *** [examples] Error 2

What is going wrong? Any suggestions?

Kai
Thread
Problems building version 2.1.1Kai Hartmann26 Apr
  • Re: Problems building version 2.1.1Warren Young27 Apr
    • Re: Problems building version 2.1.1Kai Hartmann27 Apr
      • Re: Problems building version 2.1.1Warren Young28 Apr