List:MySQL++« Previous MessageNext Message »
From:Dovid Kopel Date:November 9 2004 3:03am
Subject:Make Error
View as plain text  
-----BEGIN PGP SIGNED MESSAGE-----
Hash: SHA1

I'm receiving a make error when I am emerging mysql++-1.7.9-r6 in
Gentoo. Here is the log:

make  all-recursive
make[1]: Entering directory
`/var/tmp/portage/mysql++-1.7.9-r6/work/mysql++-1.7.9'
Making all in sqlplusint
make[2]: Entering directory
`/var/tmp/portage/mysql++-1.7.9-r6/work/mysql++-1.7.9/sqlplusint'
/bin/sh ../libtool --mode=compile c++ -DHAVE_CONFIG_H -I. -I. -I.. -I.
- -I../sqlplusint  -I/usr/include/mysql  -O2 -O2 -c string_util.cc
perl custom.pl
/bin/sh ../libtool --mode=compile c++ -DHAVE_CONFIG_H -I. -I. -I.. -I.
- -I../sqlplusint  -I/usr/include/mysql  -O2 -O2 -c coldata.cc
mkdir .libs
c++ -DHAVE_CONFIG_H -I. -I. -I.. -I. -I../sqlplusint
- -I/usr/include/mysql -O2 -O2 -Wp,-MD,.deps/string_util.pp -c  -fPIC
- -DPIC string_util.cc -o .libs/string_util.lo
rm -f .libs/coldata.lo
c++ -DHAVE_CONFIG_H -I. -I. -I.. -I. -I../sqlplusint
- -I/usr/include/mysql -O2 -O2 -Wp,-MD,.deps/coldata.pp -c  -fPIC -DPIC
coldata.cc -o .libs/coldata.lo
c++ -DHAVE_CONFIG_H -I. -I. -I.. -I. -I../sqlplusint
- -I/usr/include/mysql -O2 -O2 -Wp,-MD,.deps/string_util.pp -c
string_util.cc -o string_util.o>/dev/null 2>&1
mv -f .libs/string_util.lo string_util.lo
/bin/sh ../libtool --mode=compile c++ -DHAVE_CONFIG_H -I. -I. -I.. -I.
- -I../sqlplusint  -I/usr/include/mysql  -O2 -O2 -c connection.cc
rm -f .libs/connection.lo
c++ -DHAVE_CONFIG_H -I. -I. -I.. -I. -I../sqlplusint
- -I/usr/include/mysql -O2 -O2 -Wp,-MD,.deps/connection.pp -c  -fPIC -DPIC
connection.cc -o .libs/connection.lo
In file included from coldata1.hh:8,
~                 from coldata2.hh:5,
~                 from coldata3.hh:12,
~                 from coldata4.hh:6,
~                 from coldata.cc:3:
type_info1.hh: In constructor
`mysql_ti_sql_type_info::mysql_ti_sql_type_info()
~   ':
type_info1.hh:29: error: uninitialized member '
~   mysql_ti_sql_type_info::_base_type' with 'const' type 'const
unsignedchar'
type_info1.hh:29: error: uninitialized member
'mysql_ti_sql_type_info::_default
~   ' with 'const' type 'const bool'
make[2]: *** [coldata.lo] Error 1
make[2]: *** Waiting for unfinished jobs....
In file included from coldata1.hh:8,
~                 from field_names1.hh:9,
~                 from result1.hh:15,
~                 from query1.hh:13,
~                 from connection1.hh:19,
~                 from connection2.hh:4,
~                 from connection3.hh:2,
~                 from connection.cc:2:
type_info1.hh: In constructor
`mysql_ti_sql_type_info::mysql_ti_sql_type_info()
~   ':
type_info1.hh:29: error: uninitialized member '
~   mysql_ti_sql_type_info::_base_type' with 'const' type 'const
unsignedchar'
type_info1.hh:29: error: uninitialized member
'mysql_ti_sql_type_info::_default
~   ' with 'const' type 'const bool'
make[2]: *** [connection.lo] Error 1
make[2]: Leaving directory
`/var/tmp/portage/mysql++-1.7.9-r6/work/mysql++-1.7.9/sqlplusint'
make[1]: *** [all-recursive] Error 1
make[1]: Leaving directory
`/var/tmp/portage/mysql++-1.7.9-r6/work/mysql++-1.7.9'
make: *** [all-recursive-am] Error 2

!!! ERROR: dev-db/mysql++-1.7.9-r6 failed.
!!! Function src_compile, Line 88, Exitcode 2
!!! unable to make
!!! If you need support, post the topmost build error, NOT this status
message.
- --
- -=mUnky=-
- -Dovid Kopel
(516)-655-0489
munky@stripped
http://www.munkys.com
-----BEGIN PGP SIGNATURE-----
Version: GnuPG v1.2.6 (GNU/Linux)
Comment: Using GnuPG with Thunderbird - http://enigmail.mozdev.org

iD8DBQFBkDNoCecRKprSbsERAqhuAJ9I4xnnHEwd83c6sh68DZLiUxNd5gCaA7v/
NxTK/7syfBDgbAmGaGepuqs=
=0Vxl
-----END PGP SIGNATURE-----

Thread
Make ErrorDovid Kopel9 Nov
  • Re: Make ErrorChris Frey9 Nov