List:MySQL and Perl« Previous MessageNext Message »
From:Jochen Wiedmann Date:July 18 2002 8:35pm
Subject:Re: Problem with installing DBD-myslq
View as plain text  
Zitiere "Desrosiers, Michel" <Michel.Desrosiers@stripped>:


> t/akmisc............FAILED test 44
> 		Failed 1/351 tests, 99.72% okay
> t/dbdadmin..........dubious
> 		Test returned status 0 (wstat 11, 0xb)
> DIED. FAILED tests 5-20
> Failed 16/20 tests, 20.00% okay
> t/insertid..........ok
> t/mysql2............ok
> t/mysql.............FAILED test 23

This looks like a known problem in the test suite which
only appears if you require a password to run the suite.
You may safely ignore it.

Thread
Problem with installing DBD-myslqMichel Desrosiers17 Jul
  • Re: Problem with installing DBD-myslqJochen Wiedmann18 Jul