List:Packagers« Previous MessageNext Message »
From:Lenz Grimmer Date:December 9 2005 5:12pm
Subject:Re: Compile error of last version
View as plain text  
-----BEGIN PGP SIGNED MESSAGE-----
Hash: SHA1

Hi,

On Thu, 8 Dec 2005, Mauro Sacchetto wrote:

> I'm trying to compile mysql normal on a Slackware 10.2.  All seems to work
> fine in the first part of compilation, but at the end I receive this error
> message:
> 
> ===============================================
> In file included from /usr/include/asm/atomic.h:6,
>                  from ../include/my_global.h:309,
>                  from mysys_priv.h:17,
>                  from my_new.cc:22:
> /usr/include/asm/processor.h: In function `void set_in_cr4(long unsigned int)':
> /usr/include/asm/processor.h:235: error: `read_cr4' undeclared (first use this
> function)
> /usr/include/asm/processor.h:235: error: (Each undeclared identifier is reported only
> once for each function it appears in.)
> /usr/include/asm/processor.h:237: error: `write_cr4' undeclared (first use this
> function)
> /usr/include/asm/processor.h: In function `void clear_in_cr4(long unsigned int)':
> /usr/include/asm/processor.h:246: error: `write_cr4' undeclared (first use this
> function)
> make[1]: *** [my_new.o] Error 1
> make[1]: Leaving directory `/tmp/mysql-5.0.16/mysys'
> make: *** [install-recursive] Error 1
> ===============================================
> I'm using a kernel 2.6.14.3. Any suggestion?

Strange, that looks like a bug in a header file. What configure options did you use?

Bye,
	LenZ
- -- 
 Lenz Grimmer <lenz@stripped>
 Community Relations - Europe
 MySQL GmbH, http://www.mysql.de/, Hamburg, Germany
 MySQL Users Conference 2006 (Santa Clara CA, 24-27 April) - http://www.mysqluc.com/
-----BEGIN PGP SIGNATURE-----
Version: GnuPG v1.4.2 (GNU/Linux)
Comment: For info see http://quantumlab.net/pine_privacy_guard/

iD8DBQFDmbsgSVDhKrJykfIRAt2aAJ9xM4xFKX0f3fX2VHFHLkOm1Z9bbQCfcCuw
QBs31gmbvBoyWZwS1q6u8oA=
=wVZ0
-----END PGP SIGNATURE-----
Thread
Compile error of last versionMauro Sacchetto8 Dec
  • Re: Compile error of last versionLenz Grimmer9 Dec
    • Re: Compile error of last versionMauro Sacchetto9 Dec
      • Re: Compile error of last versionLenz Grimmer12 Dec
    • Re: Compile error of last versionMauro Sacchetto10 Dec
    • Re: Compile error of last versionMauro Sacchetto10 Dec
      • Re: Compile error of last versionTom Lane10 Dec
        • Re: Compile error of last versionLenz Grimmer12 Dec
          • Re: Compile error of last versionTom Lane12 Dec
            • Re: Compile error of last versionLenz Grimmer13 Dec