List:Packagers« Previous MessageNext Message »
From:Mauro Sacchetto Date:December 8 2005 9:03pm
Subject:Compile error of last version
View as plain text  
I'm trying to compile mysql normal on a Slackware 10.2.
All seems to work fine in the first part of compilation,
but at the end I receive this error message:

===============================================
In file included from /usr/include/asm/atomic.h:6,
                 from ../include/my_global.h:309,
                 from mysys_priv.h:17,
                 from my_new.cc:22:
/usr/include/asm/processor.h: In function `void set_in_cr4(long unsigned 
int)':
/usr/include/asm/processor.h:235: error: `read_cr4' undeclared (first use this
   function)
/usr/include/asm/processor.h:235: error: (Each undeclared identifier is
   reported only once for each function it appears in.)
/usr/include/asm/processor.h:237: error: `write_cr4' undeclared (first use 
this
   function)
/usr/include/asm/processor.h: In function `void clear_in_cr4(long unsigned 
int)
   ':
/usr/include/asm/processor.h:246: error: `write_cr4' undeclared (first use 
this
   function)
make[1]: *** [my_new.o] Error 1
make[1]: Leaving directory `/tmp/mysql-5.0.16/mysys'
make: *** [install-recursive] Error 1
===============================================
I'm using a kernel 2.6.14.3. Any suggestion?
Thanx!

MS
Thread
Compile error of last versionMauro Sacchetto8 Dec
  • Re: Compile error of last versionLenz Grimmer9 Dec
    • Re: Compile error of last versionMauro Sacchetto9 Dec
      • Re: Compile error of last versionLenz Grimmer12 Dec
    • Re: Compile error of last versionMauro Sacchetto10 Dec
    • Re: Compile error of last versionMauro Sacchetto10 Dec
      • Re: Compile error of last versionTom Lane10 Dec
        • Re: Compile error of last versionLenz Grimmer12 Dec
          • Re: Compile error of last versionTom Lane12 Dec
            • Re: Compile error of last versionLenz Grimmer13 Dec