List:General Discussion« Previous MessageNext Message »
From:Martin B. Jespersen Date:March 19 1999 10:04am
Subject:More compile errors on solaris 2.6 with mysql 3.22.20a
View as plain text  
Hi there,

This time i tried to compile without static but then look what happened:

#CC=gcc 
#CFLAGS="-O6 -fomit-frame-pointer" 
#CXX=gcc 
#CXXFLAGS="-O6 -fomit-frame-pointer -felide-constructors -fno-exceptions -fno-rtti" 
#export CC CFLAGS CXX CXXFLAGS
#./configure --prefix=/usr/local/mysql --enable-thread-safe-client --enable-assembler
--with-mysqld-user=root --without-debug
--with-charset=danish
...
#make
...
gcc -DHAVE_CONFIG_H -I. -I. -I.. -I./../include -I../include  -O6 -O6 -fomit-frame-pointer
 -DDBUG_OFF -D_LARGEFILE_SOURCE
-D_FILE_OFFSET_BITS=64 -c strtoull.c
as -o strings.o strings.s
as: "strings.s", line 1: error: unknown opcode "Copyright"
as: "strings.s", line 1: error: statement syntax
as: "strings.s", line 2: error: statement syntax
as: "strings.s", line 3: error: unknown opcode "This"
as: "strings.s", line 3: error: statement syntax
as: "strings.s", line 4: error: unknown opcode "distributor"
as: "strings.s", line 4: error: statement syntax
as: "strings.s", line 5: error: statement syntax
as: "strings.s", line 6: error: unknown opcode "she"
as: "strings.s", line 6: error: statement syntax
as: "strings.s", line 7: error: statement syntax
as: "strings.s", line 8: error: unknown opcode "Every"
as: "strings.s", line 8: error: statement syntax
as: "strings.s", line 9: error: unknown opcode "plain"
as: "strings.s", line 9: error: statement syntax
as: "strings.s", line 10: error: unknown opcode "copy"
as: "strings.s", line 10: error: statement syntax
as: "strings.s", line 11: error: unknown opcode "described"
as: "strings.s", line 11: error: statement syntax
as: "strings.s", line 12: error: unknown opcode "the"
as: "strings.s", line 12: error: statement syntax
as: "strings.s", line 13: error: statement syntax
as: "strings.s", line 14: error: unknown opcode "Optimized"
as: "strings.s", line 14: error: statement syntax
as: "strings.s", line 17: error: .version "1.00" greater than assembler version ""
as: "strings.s", line 20: error: statement syntax
as: "strings.s", line 21: error: unknown opcode "Move"
as: "strings.s", line 21: error: statement syntax
as: "strings.s", line 22: error: unknown opcode "to"
as: "strings.s", line 22: error: statement syntax
as: "strings.s", line 23: error: statement syntax
as: "strings.s", line 26: error: invalid character (0x40)
as: "strings.s", line 28: error: unknown "%"-symbol
as: "strings.s", line 28: error: unknown "%"-symbol
as: "strings.s", line 28: error: statement syntax
as: "strings.s", line 29: error: unknown "%"-symbol
as: "strings.s", line 29: error: unknown "%"-symbol
as: "strings.s", line 29: error: statement syntax
as: "strings.s", line 30: error: unknown "%"-symbol
as: "strings.s", line 30: error: unknown "%"-symbol
as: "strings.s", line 30: error: statement syntax
as: "strings.s", line 31: error: unknown "%"-symbol
as: "strings.s", line 31: error: unknown "%"-symbol
as: "strings.s", line 31: error: statement syntax
as: "strings.s", line 32: error: unknown "%"-symbol
as: "strings.s", line 32: error: unknown "%"-symbol
as: "strings.s", line 32: error: statement syntax
as: "strings.s", line 33: error: unknown opcode "addl"
as: "strings.s", line 33: error: unknown "%"-symbol
as: "strings.s", line 33: error: statement syntax
as: "strings.s", line 34: error: unknown opcode "shrl"
as: "strings.s", line 34: error: unknown "%"-symbol
as: "strings.s", line 34: error: statement syntax
as: "strings.s", line 35: error: unknown opcode "rep"
as: "strings.s", line 35: error: statement syntax
as: "strings.s", line 36: error: unknown opcode "movsl"
as: "strings.s", line 36: error: statement syntax
as: "strings.s", line 37: error: unknown "%"-symbol
as: "strings.s", line 37: error: unknown "%"-symbol
as: "strings.s", line 37: error: statement syntax
as: "strings.s", line 38: error: unknown "%"-symbol
as: "strings.s", line 38: error: unknown "%"-symbol
as: "strings.s", line 38: error: statement syntax
as: "strings.s", line 43: error: statement syntax
as: "strings.s", line 44: error: unknown opcode "Move"
as: "strings.s", line 44: error: statement syntax
as: "strings.s", line 45: error: unknown opcode "Arg"
as: "strings.s", line 45: error: statement syntax
as: "strings.s", line 46: error: statement syntax
as: "strings.s", line 49: error: invalid character (0x40)
as: "strings.s", line 51: error: statement syntax
as: "strings.s", line 52: error: unknown "%"-symbol
as: "strings.s", line 52: error: unknown "%"-symbol
as: "strings.s", line 52: error: statement syntax
as: "strings.s", line 53: error: unknown "%"-symbol
as: "strings.s", line 53: error: unknown "%"-symbol
as: "strings.s", line 53: error: statement syntax
as: "strings.s", line 54: error: unknown "%"-symbol
as: "strings.s", line 54: error: unknown "%"-symbol
as: "strings.s", line 54: error: statement syntax
as: "strings.s", line 55: error: unknown "%"-symbol
as: "strings.s", line 55: error: unknown "%"-symbol
as: "strings.s", line 55: error: statement syntax
as: "strings.s", line 56: error: unknown "%"-symbol
as: "strings.s", line 56: error: unknown "%"-symbol
as: "strings.s", line 56: error: statement syntax
as: "strings.s", line 57: error: unknown opcode "decl"
as: "strings.s", line 57: error: unknown "%"-symbol
as: "strings.s", line 57: error: unterminated string
as: "strings.s", line 57: error: statement syntax
as: "strings.s", line 58: error: unknown opcode "decl"
as: "strings.s", line 58: error: unknown "%"-symbol
as: "strings.s", line 58: error: statement syntax
as: "strings.s", line 59: error: unknown opcode "rep"
as: "strings.s", line 59: error: statement syntax
as: "strings.s", line 60: error: unknown opcode "movsb"
as: "strings.s", line 60: error: statement syntax
as: "strings.s", line 61: error: unknown opcode "cld"
as: "strings.s", line 61: error: statement syntax
as: "strings.s", line 62: error: unknown "%"-symbol
as: "strings.s", line 62: error: unknown "%"-symbol
as: "strings.s", line 62: error: statement syntax
as: "strings.s", line 63: error: unknown "%"-symbol
as: "strings.s", line 63: error: unknown "%"-symbol
as: "strings.s", line 63: error: statement syntax
as: "strings.s", line 68: error: statement syntax
as: "strings.s", line 69: error: unknown opcode "Append"
as: "strings.s", line 69: error: statement syntax
as: "strings.s", line 70: error: unknown opcode "dest"
as: "strings.s", line 70: error: statement syntax
as: "strings.s", line 71: error: statement syntax
as: "strings.s", line 74: error: invalid character (0x40)
as: "strings.s", line 76: error: unknown opcode "pushl"
as: "strings.s", line 76: error: unknown "%"-symbol
as: "strings.s", line 76: error: statement syntax
as: "strings.s", line 77: error: unknown "%"-symbol
as: "strings.s", line 77: error: unknown "%"-symbol
as: "strings.s", line 77: error: statement syntax
as: "strings.s", line 78: error: unknown "%"-symbol
as: "strings.s", line 78: error: unknown "%"-symbol
as: "strings.s", line 78: error: statement syntax
as: "strings.s", line 79: error: unknown opcode "clrl"
as: "strings.s", line 79: error: unknown "%"-symbol
as: "strings.s", line 79: error: statement syntax
as: "strings.s", line 80: error: unknown opcode "repne"
as: "strings.s", line 80: error: statement syntax
as: "strings.s", line 81: error: unknown opcode "scasb"
as: "strings.s", line 81: error: statement syntax
as: "strings.s", line 82: error: unknown opcode "jnz"
as: "strings.s", line 82: error: statement syntax
as: "strings.s", line 83: error: unknown opcode "movzb"
as: "strings.s", line 83: error: unknown "%"-symbol
as: "strings.s", line 83: error: unknown "%"-symbol
as: "strings.s", line 83: error: statement syntax
as: "strings.s", line 84: error: unknown opcode "decl"
as: "strings.s", line 84: error: unknown "%"-symbol
as: "strings.s", line 84: error: statement syntax
as: "strings.s", line 85: error: unknown opcode "incl"
as: "strings.s", line 85: error: unknown "%"-symbol
as: "strings.s", line 85: error: statement syntax
as: "strings.s", line 87: error: unknown opcode "movb"
as: "strings.s", line 87: error: unknown "%"-symbol
as: "strings.s", line 87: error: unknown "%"-symbol
as: "strings.s", line 87: error: statement syntax
as: "strings.s", line 88: error: unknown opcode "movw"
as: "strings.s", line 88: error: unknown "%"-symbol
as: "strings.s", line 88: error: unknown "%"-symbol
as: "strings.s", line 88: error: statement syntax
as: "strings.s", line 89: error: unknown opcode "shll"
as: "strings.s", line 89: error: unknown "%"-symbol
as: "strings.s", line 89: error: statement syntax
as: "strings.s", line 90: error: unknown opcode "movw"
as: "strings.s", line 90: error: unknown "%"-symbol
as: "strings.s", line 90: error: unknown "%"-symbol
as: "strings.s", line 90: error: unknown "%"-symbol
as: "strings.s", line 90: error: statement syntax
as: "strings.s", line 92: error: unknown "%"-symbol
as: "strings.s", line 92: error: unknown "%"-symbol
as: "strings.s", line 92: error: statement syntax
as: "strings.s", line 93: error: unknown opcode "shrl"
as: "strings.s", line 93: error: unknown "%"-symbol
as: "strings.s", line 93: error: statement syntax
as: "strings.s", line 94: error: unknown opcode "rep"
as: "strings.s", line 94: error: statement syntax
as: "strings.s", line 95: error: unknown opcode "stosl"
as: "strings.s", line 95: error: statement syntax
as: "strings.s", line 96: error: unknown opcode "movb"
as: "strings.s", line 96: error: statement syntax
as: "strings.s", line 97: error: unknown "%"-symbol
as: "strings.s", line 97: error: statement syntax
as: "strings.s", line 97: error: unknown "%"-symbol
as: "strings.s", line 97: error: statement syntax
as: "strings.s", line 98: error: unknown opcode "rep"
as: "strings.s", line 98: error: statement syntax
as: "strings.s", line 99: error: unknown opcode "stosb"
as: "strings.s", line 99: error: statement syntax
as: "strings.s", line 101: error: unknown opcode "movb"
as: "strings.s", line 101: error: unknown "%"-symbol
as: "strings.s", line 101: error: statement syntax
as: "strings.s", line 102: error: unknown opcode "popl"
as: "strings.s", line 102: error: unknown "%"-symbol
as: "strings.s", line 102: error: statement syntax
as: "strings.s", line 107: error: statement syntax
as: "strings.s", line 108: error: unknown opcode "Find"
as: "strings.s", line 108: error: statement syntax
as: "strings.s", line 109: error: unknown opcode "str"
as: "strings.s", line 109: error: statement syntax
as: "strings.s", line 110: error: unknown opcode "Pointer"
as: "strings.s", line 110: error: statement syntax
as: "strings.s", line 111: error: statement syntax
as: "strings.s", line 114: error: invalid character (0x40)
as: "strings.s", line 116: error: unknown "%"-symbol
as: "strings.s", line 116: error: unknown "%"-symbol
as: "strings.s", line 116: error: statement syntax
as: "strings.s", line 117: error: unknown opcode "pushl"
as: "strings.s", line 117: error: unknown "%"-symbol
as: "strings.s", line 117: error: statement syntax
as: "strings.s", line 118: error: unknown "%"-symbol
as: "strings.s", line 118: error: unknown "%"-symbol
as: "strings.s", line 118: error: statement syntax
as: "strings.s", line 119: error: unknown "%"-symbol
as: "strings.s", line 119: error: unknown "%"-symbol
as: "strings.s", line 119: error: statement syntax
as: "strings.s", line 120: error: unknown "%"-symbol
as: "strings.s", line 120: error: statement syntax
as: "strings.s", line 120: error: statement syntax
as: "strings.s", line 121: warning: questionable use of relocatable value
as: "strings.s", line 123: error: unknown opcode "scasb"
as: "strings.s", line 123: error: statement syntax
as: "strings.s", line 124: error: unknown opcode "jz"
as: "strings.s", line 124: error: statement syntax
as: "strings.s", line 125: error: unknown "%"-symbol
as: "strings.s", line 125: error: unknown "%"-symbol
as: "strings.s", line 125: error: statement syntax
as: "strings.s", line 126: error: unknown opcode "jnz"
as: "strings.s", line 126: error: statement syntax
as: "strings.s", line 127: error: unknown opcode "incl"
as: "strings.s", line 127: error: unknown "%"-symbol
as: "strings.s", line 127: error: statement syntax
as: "strings.s", line 128: error: unknown "%"-symbol
as: "strings.s", line 128: error: unknown "%"-symbol
as: "strings.s", line 128: error: unknown "%"-symbol
as: "strings.s", line 128: error: statement syntax
as: "strings.s", line 129: error: unknown opcode "movb"
as: "strings.s", line 129: error: unknown "%"-symbol
as: "strings.s", line 129: error: unknown "%"-symbol
as: "strings.s", line 129: error: statement syntax
as: "strings.s", line 130: error: unknown opcode "andb"
as: "strings.s", line 130: error: unknown "%"-symbol
as: "strings.s", line 130: error: unknown "%"-symbol
as: "strings.s", line 130: error: statement syntax
as: "strings.s", line 131: error: unknown opcode "jnz"
as: "strings.s", line 131: error: statement syntax
as: "strings.s", line 132: error: unknown opcode "clrl"
as: "strings.s", line 132: error: unknown "%"-symbol
as: "strings.s", line 132: error: statement syntax
as: "strings.s", line 133: error: unknown "%"-symbol
as: "strings.s", line 133: error: unknown "%"-symbol
as: "strings.s", line 133: error: statement syntax
as: "strings.s", line 134: error: unknown "%"-symbol
as: "strings.s", line 134: error: unknown "%"-symbol
as: "strings.s", line 134: error: statement syntax
as: "strings.s", line 135: error: unknown opcode "popl"
as: "strings.s", line 135: error: unknown "%"-symbol
as: "strings.s", line 135: error: statement syntax
as: "strings.s", line 140: error: statement syntax
as: "strings.s", line 141: error: unknown opcode "Find"
as: "strings.s", line 141: error: statement syntax
as: "strings.s", line 142: error: unknown opcode "str"
as: "strings.s", line 142: error: statement syntax
as: "strings.s", line 143: error: unknown opcode "Pointer"
as: "strings.s", line 143: error: statement syntax
as: "strings.s", line 144: error: statement syntax
as: "strings.s", line 147: error: invalid character (0x40)
as: "strings.s", line 149: error: unknown "%"-symbol
as: "strings.s", line 149: error: unknown "%"-symbol
as: "strings.s", line 149: error: statement syntax
as: "strings.s", line 150: error: unknown "%"-symbol
as: "strings.s", line 150: error: unknown "%"-symbol
as: "strings.s", line 150: error: statement syntax
as: "strings.s", line 151: error: unknown opcode "clrl"
as: "strings.s", line 151: error: unknown "%"-symbol
as: "strings.s", line 151: error: statement syntax
as: "strings.s", line 152: error: unknown "%"-symbol
as: "strings.s", line 152: error: unknown "%"-symbol
as: "strings.s", line 152: error: statement syntax
as: "strings.s", line 153: error: unknown opcode "decl"
as: "strings.s", line 153: error: unknown "%"-symbol
as: "strings.s", line 153: error: statement syntax
as: "strings.s", line 154: error: unknown opcode "repne"
as: "strings.s", line 154: error: statement syntax
as: "strings.s", line 155: error: unknown opcode "scasb"
as: "strings.s", line 155: error: statement syntax
as: "strings.s", line 156: error: unknown "%"-symbol
as: "strings.s", line 156: error: unknown "%"-symbol
as: "strings.s", line 156: error: statement syntax
as: "strings.s", line 157: error: unknown opcode "decl"
as: "strings.s", line 157: error: unknown "%"-symbol
as: "strings.s", line 157: error: statement syntax
as: "strings.s", line 158: error: unknown "%"-symbol
as: "strings.s", line 158: error: unknown "%"-symbol
as: "strings.s", line 158: error: statement syntax
as: "strings.s", line 163: error: statement syntax
as: "strings.s", line 164: error: unknown opcode "Make"
as: "strings.s", line 164: error: statement syntax
as: "strings.s", line 165: error: unknown opcode "dest"
as: "strings.s", line 165: error: statement syntax
as: "strings.s", line 166: error: unknown opcode "dest"
as: "strings.s", line 166: error: statement syntax
as: "strings.s", line 167: error: statement syntax
as: "strings.s", line 170: error: invalid character (0x40)
as: "strings.s", line 172: error: unknown opcode "pushl"
as: "strings.s", line 172: error: unknown "%"-symbol
as: "strings.s", line 172: error: statement syntax
as: "strings.s", line 173: error: unknown "%"-symbol
as: "strings.s", line 173: error: unknown "%"-symbol
as: "strings.s", line 173: error: statement syntax
as: "strings.s", line 174: error: unknown "%"-symbol
as: "strings.s", line 174: error: unknown "%"-symbol
as: "strings.s", line 174: error: statement syntax
as: "strings.s", line 175: error: unknown opcode "movzb"
as: "strings.s", line 175: error: unknown "%"-symbol
as: "strings.s", line 175: error: unknown "%"-symbol
as: "strings.s", line 175: error: statement syntax
as: "strings.s", line 177: error: unknown opcode "movb"
as: "strings.s", line 177: error: unknown "%"-symbol
as: "strings.s", line 177: error: unknown "%"-symbol
as: "strings.s", line 177: error: statement syntax
as: "strings.s", line 178: error: unknown opcode "movw"
as: "strings.s", line 178: error: unknown "%"-symbol
as: "strings.s", line 178: error: unknown "%"-symbol
as: "strings.s", line 178: error: statement syntax
as: "strings.s", line 179: error: unknown opcode "shll"
as: "strings.s", line 179: error: unknown "%"-symbol
as: "strings.s", line 179: error: statement syntax
as: "strings.s", line 180: error: unknown opcode "movw"
as: "strings.s", line 180: error: unknown "%"-symbol
as: "strings.s", line 180: error: unknown "%"-symbol
as: "strings.s", line 180: error: unknown "%"-symbol
as: "strings.s", line 180: error: statement syntax
as: "strings.s", line 182: error: unknown "%"-symbol
as: "strings.s", line 182: error: unknown "%"-symbol
as: "strings.s", line 182: error: statement syntax
as: "strings.s", line 183: error: unknown opcode "shrl"
as: "strings.s", line 183: error: unknown "%"-symbol
as: "strings.s", line 183: error: statement syntax
as: "strings.s", line 184: error: unknown opcode "rep"
as: "strings.s", line 184: error: statement syntax
as: "strings.s", line 185: error: unknown opcode "stosl"
as: "strings.s", line 185: error: statement syntax
as: "strings.s", line 186: error: unknown opcode "movb"
as: "strings.s", line 186: error: statement syntax
as: "strings.s", line 187: error: unknown "%"-symbol
as: "strings.s", line 187: error: statement syntax
as: "strings.s", line 187: error: unknown "%"-symbol
as: "strings.s", line 187: error: statement syntax
as: "strings.s", line 188: error: unknown opcode "rep"
as: "strings.s", line 188: error: statement syntax
as: "strings.s", line 189: error: unknown opcode "stosb"
as: "strings.s", line 189: error: statement syntax
as: "strings.s", line 191: error: unknown opcode "movb"
as: "strings.s", line 191: error: unknown "%"-symbol
as: "strings.s", line 191: error: statement syntax
as: "strings.s", line 192: error: unknown "%"-symbol
as: "strings.s", line 192: error: unknown "%"-symbol
as: "strings.s", line 192: error: unknown "%"-symbol
as: "strings.s", line 192: error: statement syntax
as: "strings.s", line 193: error: unknown opcode "popl"
as: "strings.s", line 193: error: unknown "%"-symbol
as: "strings.s", line 193: error: statement syntax
as: "strings.s", line 199: error: statement syntax
as: "strings.s", line 200: error: unknown opcode "Find"
as: "strings.s", line 200: error: statement syntax
as: "strings.s", line 201: error: unknown opcode "str"
as: "strings.s", line 201: error: statement syntax
as: "strings.s", line 202: error: unknown opcode "pointer"
as: "strings.s", line 202: error: statement syntax
as: "strings.s", line 203: error: statement syntax
as: "strings.s", line 206: error: invalid character (0x40)
as: "strings.s", line 208: error: unknown "%"-symbol
as: "strings.s", line 208: error: unknown "%"-symbol
as: "strings.s", line 208: error: statement syntax
as: "strings.s", line 209: error: unknown "%"-symbol
as: "strings.s", line 209: error: unknown "%"-symbol
as: "strings.s", line 209: error: statement syntax
as: "strings.s", line 210: error: unknown opcode "movb"
as: "strings.s", line 210: error: unknown "%"-symbol
as: "strings.s", line 210: error: unknown "%"-symbol
as: "strings.s", line 210: error: statement syntax
as: "strings.s", line 211: error: unknown "%"-symbol
as: "strings.s", line 211: error: statement syntax
as: "strings.s", line 211: error: statement syntax
as: "strings.s", line 213: error: unknown opcode "cmpb"
as: "strings.s", line 213: error: unknown "%"-symbol
as: "strings.s", line 213: error: unknown "%"-symbol
as: "strings.s", line 213: error: statement syntax
as: "strings.s", line 214: error: unknown opcode "jz"
as: "strings.s", line 214: error: statement syntax
as: "strings.s", line 215: error: unknown opcode "scasb"
as: "strings.s", line 215: error: statement syntax
as: "strings.s", line 216: error: unknown opcode "jnz"
as: "strings.s", line 216: error: statement syntax
as: "strings.s", line 217: error: unknown "%"-symbol
as: "strings.s", line 217: error: statement syntax
as: "strings.s", line 218: error: unknown "%"-symbol
as: "strings.s", line 218: error: unknown "%"-symbol
as: "strings.s", line 218: error: statement syntax
as: "strings.s", line 219: error: unknown "%"-symbol
as: "strings.s", line 219: error: unknown "%"-symbol
as: "strings.s", line 219: error: statement syntax
as: "strings.s", line 224: error: statement syntax
as: "strings.s", line 225: error: unknown opcode "Test"
as: "strings.s", line 225: error: statement syntax
as: "strings.s", line 226: error: statement syntax
as: "strings.s", line 229: error: invalid character (0x40)
as: "strings.s", line 231: error: unknown "%"-symbol
as: "strings.s", line 231: error: unknown "%"-symbol
as: "strings.s", line 231: error: unknown "%"-symbol
as: "strings.s", line 231: error: statement syntax
as: "strings.s", line 232: error: unknown opcode "pushl"
as: "strings.s", line 232: error: unknown "%"-symbol
as: "strings.s", line 232: error: unknown "%"-symbol
as: "strings.s", line 232: error: statement syntax
as: "strings.s", line 233: error: unknown "%"-symbol
as: "strings.s", line 233: error: unknown "%"-symbol
as: "strings.s", line 233: error: statement syntax
as: "strings.s", line 234: error: unknown "%"-symbol
as: "strings.s", line 234: error: unknown "%"-symbol
as: "strings.s", line 234: error: statement syntax
as: "strings.s", line 235: error: unknown "%"-symbol
as: "strings.s", line 235: error: statement syntax
as: "strings.s", line 236: error: unknown opcode "cmpb"
as: "strings.s", line 236: error: unknown "%"-symbol
as: "strings.s", line 236: error: unknown "%"-symbol
as: "strings.s", line 236: error: statement syntax
as: "strings.s", line 237: error: unknown opcode "jz"
as: "strings.s", line 237: error: statement syntax
as: "strings.s", line 238: error: unknown opcode "cmpsb"
as: "strings.s", line 238: error: statement syntax
as: "strings.s", line 239: error: unknown opcode "jz"
as: "strings.s", line 239: error: statement syntax
as: "strings.s", line 240: error: unknown "%"-symbol
as: "strings.s", line 240: error: statement syntax
as: "strings.s", line 240: error: unknown "%"-symbol
as: "strings.s", line 240: error: statement syntax
as: "strings.s", line 241: error: unknown opcode "popl"
as: "strings.s", line 241: error: unknown "%"-symbol
as: "strings.s", line 241: error: statement syntax
as: "strings.s", line 242: error: unknown "%"-symbol
as: "strings.s", line 242: error: unknown "%"-symbol
as: "strings.s", line 242: error: statement syntax
as: "strings.s", line 247: error: statement syntax
as: "strings.s", line 248: error: unknown opcode "Find"
as: "strings.s", line 248: error: statement syntax
as: "strings.s", line 249: error: unknown opcode "str"
as: "strings.s", line 249: error: statement syntax
as: "strings.s", line 250: error: statement syntax
as: "strings.s", line 253: error: invalid character (0x40)
as: "strings.s", line 256: error: unknown opcode "pushl"
as: "strings.s", line 256: error: unknown "%"-symbol
as: "strings.s", line 256: error: statement syntax
as: "strings.s", line 257: error: unknown opcode "pushl"
as: "strings.s", line 257: error: unknown "%"-symbol
as: "strings.s", line 257: error: statement syntax
as: "strings.s", line 258: error: unknown "%"-symbol
as: "strings.s", line 258: error: unknown "%"-symbol
as: "strings.s", line 258: error: statement syntax
as: "strings.s", line 259: error: unknown "%"-symbol
as: "strings.s", line 259: error: unknown "%"-symbol
as: "strings.s", line 259: error: statement syntax
as: "strings.s", line 260: error: unknown "%"-symbol
as: "strings.s", line 260: error: unknown "%"-symbol
as: "strings.s", line 260: error: statement syntax
as: "strings.s", line 261: error: unknown opcode "incl"
as: "strings.s", line 261: error: unknown "%"-symbol
as: "strings.s", line 261: error: unknown "%"-symbol
as: "strings.s", line 261: error: statement syntax
as: "strings.s", line 262: error: unknown opcode "movb"
as: "strings.s", line 262: error: unknown "%"-symbol
as: "strings.s", line 262: error: unknown "%"-symbol
as: "strings.s", line 262: error: unknown "%"-symbol
as: "strings.s", line 262: error: statement syntax
as: "strings.s", line 263: warning: questionable use of relocatable value
as: "strings.s", line 265: error: unknown "%"-symbol
as: "strings.s", line 265: error: unknown "%"-symbol
as: "strings.s", line 265: error: statement syntax
as: "strings.s", line 266: error: unknown opcode "movb"
as: "strings.s", line 266: error: unknown "%"-symbol
as: "strings.s", line 266: error: unknown "%"-symbol
as: "strings.s", line 266: error: statement syntax
as: "strings.s", line 267: error: unknown opcode "andb"
as: "strings.s", line 267: error: unknown "%"-symbol
as: "strings.s", line 267: error: unknown "%"-symbol
as: "strings.s", line 267: error: statement syntax
as: "strings.s", line 268: error: unknown opcode "jz"
as: "strings.s", line 268: error: unterminated string
as: "strings.s", line 268: error: statement syntax
as: "strings.s", line 269: error: unknown opcode "incl"
as: "strings.s", line 269: error: unknown "%"-symbol
as: "strings.s", line 269: error: statement syntax
as: "strings.s", line 270: error: unknown opcode "cmpb"
as: "strings.s", line 270: error: unknown "%"-symbol
as: "strings.s", line 270: error: unknown "%"-symbol
as: "strings.s", line 270: error: statement syntax
as: "strings.s", line 271: error: unknown opcode "jnz"
as: "strings.s", line 271: error: unterminated string
as: "strings.s", line 271: error: statement syntax
as: "strings.s", line 272: error: unknown "%"-symbol
as: "strings.s", line 272: error: unknown "%"-symbol
as: "strings.s", line 272: error: unknown "%"-symbol
as: "strings.s", line 272: error: statement syntax
as: "strings.s", line 273: error: unknown "%"-symbol
as: "strings.s", line 273: error: unknown "%"-symbol
as: "strings.s", line 273: error: statement syntax
as: "strings.s", line 274: error: unknown opcode "cmpb"
as: "strings.s", line 274: error: unknown "%"-symbol
as: "strings.s", line 274: error: statement syntax
as: "strings.s", line 275: error: unknown opcode "jz"
as: "strings.s", line 275: error: statement syntax
as: "strings.s", line 276: error: unknown opcode "cmpsb"
as: "strings.s", line 276: error: statement syntax
as: "strings.s", line 277: error: unknown opcode "jz"
as: "strings.s", line 277: error: statement syntax
as: "strings.s", line 278: warning: questionable use of relocatable value
as: "strings.s", line 278: error: statement syntax
as: "strings.s", line 280: error: unknown "%"-symbol
as: "strings.s", line 280: error: statement syntax
as: "strings.s", line 281: error: unknown "%"-symbol
as: "strings.s", line 281: error: unknown "%"-symbol
as: "strings.s", line 281: error: statement syntax
as: "strings.s", line 282: error: unknown opcode "decl"
as: "strings.s", line 282: error: unknown "%"-symbol
as: "strings.s", line 282: error: statement syntax
as: "strings.s", line 283: error: unknown opcode "popl"
as: "strings.s", line 283: error: unknown "%"-symbol
as: "strings.s", line 283: error: statement syntax
as: "strings.s", line 284: error: unknown opcode "popl"
as: "strings.s", line 284: error: unknown "%"-symbol
as: "strings.s", line 284: error: statement syntax
as: "strings.s", line 290: error: statement syntax
as: "strings.s", line 291: error: unknown opcode "Find"
as: "strings.s", line 291: error: statement syntax
as: "strings.s", line 292: error: unknown opcode "str"
as: "strings.s", line 292: error: statement syntax
as: "strings.s", line 293: error: statement syntax
as: "strings.s", line 296: error: invalid character (0x40)
as: "strings.s", line 299: error: unknown opcode "pushl"
as: "strings.s", line 299: error: unknown "%"-symbol
as: "strings.s", line 299: error: statement syntax
as: "strings.s", line 300: error: unknown "%"-symbol
as: "strings.s", line 300: error: unknown "%"-symbol
as: "strings.s", line 300: error: statement syntax
as: "strings.s", line 301: error: unknown opcode "pushl"
as: "strings.s", line 301: error: unknown "%"-symbol
as: "strings.s", line 301: error: statement syntax
as: "strings.s", line 302: error: unknown opcode "pushl"
as: "strings.s", line 302: error: unknown "%"-symbol
as: "strings.s", line 302: error: statement syntax
as: "strings.s", line 304: error: unknown "%"-symbol
as: "strings.s", line 304: error: statement syntax
as: "strings.s", line 305: error: unknown "%"-symbol
as: "strings.s", line 305: error: statement syntax
as: "strings.s", line 305: error: unknown "%"-symbol
as: "strings.s", line 305: error: statement syntax
as: "strings.s", line 306: error: unknown opcode "jz"
as: "strings.s", line 306: error: statement syntax
as: "strings.s", line 307: error: unknown "%"-symbol
as: "strings.s", line 307: error: unknown "%"-symbol
as: "strings.s", line 307: error: statement syntax
as: "strings.s", line 308: error: unknown "%"-symbol
as: "strings.s", line 308: error: statement syntax
as: "strings.s", line 309: error: unknown opcode "popl"
as: "strings.s", line 309: error: unknown "%"-symbol
as: "strings.s", line 309: error: statement syntax
as: "strings.s", line 314: error: statement syntax
as: "strings.s", line 315: error: unknown opcode "Make"
as: "strings.s", line 315: error: statement syntax
as: "strings.s", line 316: error: unknown opcode "dst"
as: "strings.s", line 316: error: statement syntax
as: "strings.s", line 317: error: unknown opcode "end"
as: "strings.s", line 317: error: statement syntax
as: "strings.s", line 318: error: statement syntax
as: "strings.s", line 321: error: invalid character (0x40)
as: "strings.s", line 324: error: unknown opcode "pushl"
as: "strings.s", line 324: error: unknown "%"-symbol
as: "strings.s", line 324: error: statement syntax
as: "strings.s", line 325: error: unknown opcode "pushl"
as: "strings.s", line 325: error: unknown "%"-symbol
as: "strings.s", line 325: error: statement syntax
as: "strings.s", line 326: error: unknown "%"-symbol
as: "strings.s", line 326: error: unknown "%"-symbol
as: "strings.s", line 326: error: statement syntax
as: "strings.s", line 327: error: unknown "%"-symbol
as: "strings.s", line 327: error: unknown "%"-symbol
as: "strings.s", line 327: error: statement syntax
as: "strings.s", line 328: error: unknown "%"-symbol
as: "strings.s", line 328: error: unknown "%"-symbol
as: "strings.s", line 328: error: statement syntax
as: "strings.s", line 329: error: unknown "%"-symbol
as: "strings.s", line 329: error: statement syntax
as: "strings.s", line 329: error: statement syntax
as: "strings.s", line 330: error: unknown opcode "jecxz"
as: "strings.s", line 330: error: statement syntax
as: "strings.s", line 332: error: unknown opcode "cmpb"
as: "strings.s", line 332: error: unknown "%"-symbol
as: "strings.s", line 332: error: unknown "%"-symbol
as: "strings.s", line 332: error: statement syntax
as: "strings.s", line 333: error: unknown opcode "movsb"
as: "strings.s", line 333: error: statement syntax
as: "strings.s", line 334: error: unknown opcode "jz"
as: "strings.s", line 334: error: statement syntax
as: "strings.s", line 335: error: unknown opcode "loop"
as: "strings.s", line 335: error: statement syntax
as: "strings.s", line 336: error: unknown opcode "movb"
as: "strings.s", line 336: error: unknown "%"-symbol
as: "strings.s", line 336: error: unknown "%"-symbol
as: "strings.s", line 336: error: statement syntax
as: "strings.s", line 337: error: unknown opcode "incl"
as: "strings.s", line 337: error: unknown "%"-symbol
as: "strings.s", line 337: error: statement syntax
as: "strings.s", line 338: error: unknown opcode "decl"
as: "strings.s", line 338: error: unknown "%"-symbol
as: "strings.s", line 338: error: statement syntax
as: "strings.s", line 339: error: unknown "%"-symbol
as: "strings.s", line 339: error: unknown "%"-symbol
as: "strings.s", line 339: error: statement syntax
as: "strings.s", line 340: error: unknown opcode "popl"
as: "strings.s", line 340: error: unknown "%"-symbol
as: "strings.s", line 340: error: statement syntax
as: "strings.s", line 341: error: unknown opcode "popl"
as: "strings.s", line 341: error: unknown "%"-symbol
as: "strings.s", line 341: error: statement syntax
as: "strings.s", line 346: error: unknown opcode "Move"
as: "strings.s", line 346: error: statement syntax
as: "strings.s", line 347: error: unknown opcode "dst"
as: "strings.s", line 347: error: statement syntax
as: "strings.s", line 348: error: unknown opcode "pos"
as: "strings.s", line 348: error: statement syntax
as: "strings.s", line 351: error: invalid character (0x40)
as: "strings.s", line 353: error: unknown opcode "pushl"
as: "strings.s", line 353: error: unknown "%"-symbol
as: "strings.s", line 353: error: statement syntax
as: "strings.s", line 354: error: unknown opcode "pushl"
as: "strings.s", line 354: error: unknown "%"-symbol
as: "strings.s", line 354: error: statement syntax
as: "strings.s", line 355: error: unknown "%"-symbol
as: "strings.s", line 355: error: unknown "%"-symbol
as: "strings.s", line 355: error: statement syntax
as: "strings.s", line 356: error: unknown "%"-symbol
as: "strings.s", line 356: error: unknown "%"-symbol
as: "strings.s", line 356: error: statement syntax
as: "strings.s", line 357: error: unknown "%"-symbol
as: "strings.s", line 357: error: unknown "%"-symbol
as: "strings.s", line 357: error: statement syntax
as: "strings.s", line 358: error: unknown opcode "jecxz"
as: "strings.s", line 358: error: statement syntax
as: "strings.s", line 359: error: unknown "%"-symbol
as: "strings.s", line 359: error: statement syntax
as: "strings.s", line 359: error: statement syntax
as: "strings.s", line 361: error: unknown opcode "cmpb"
as: "strings.s", line 361: error: unknown "%"-symbol
as: "strings.s", line 361: error: unknown "%"-symbol
as: "strings.s", line 361: error: statement syntax
as: "strings.s", line 362: error: unknown opcode "movsb"
as: "strings.s", line 362: error: statement syntax
as: "strings.s", line 363: error: unknown opcode "jz"
as: "strings.s", line 363: error: statement syntax
as: "strings.s", line 364: error: unknown opcode "loop"
as: "strings.s", line 364: error: statement syntax
as: "strings.s", line 365: error: unknown opcode "incl"
as: "strings.s", line 365: error: unknown "%"-symbol
as: "strings.s", line 365: error: statement syntax
as: "strings.s", line 366: error: unknown opcode "decl"
as: "strings.s", line 366: error: unknown "%"-symbol
as: "strings.s", line 366: error: statement syntax
as: "strings.s", line 367: error: unknown "%"-symbol
as: "strings.s", line 367: error: unknown "%"-symbol
as: "strings.s", line 367: error: statement syntax
as: "strings.s", line 368: error: unknown opcode "popl"
as: "strings.s", line 368: error: unknown "%"-symbol
as: "strings.s", line 368: error: statement syntax
as: "strings.s", line 369: error: unknown opcode "popl"
as: "strings.s", line 369: error: unknown "%"-symbol
as: "strings.s", line 369: error: statement syntax
as: "strings.s", line 376: error: invalid character (0x40)
as: "strings.s", line 378: error: unknown "%"-symbol
as: "strings.s", line 378: error: unknown "%"-symbol
as: "strings.s", line 378: error: unknown "%"-symbol
as: "strings.s", line 378: error: unknown "%"-symbol
as: "strings.s", line 378: error: statement syntax
as: "strings.s", line 379: error: unknown "%"-symbol
as: "strings.s", line 379: error: unknown "%"-symbol
as: "strings.s", line 379: error: statement syntax
as: "strings.s", line 380: error: unknown "%"-symbol
as: "strings.s", line 380: error: unknown "%"-symbol
as: "strings.s", line 380: error: statement syntax
as: "strings.s", line 381: error: unknown "%"-symbol
as: "strings.s", line 381: error: unknown "%"-symbol
as: "strings.s", line 381: error: unknown "%"-symbol
as: "strings.s", line 381: error: expression syntax
as: "strings.s", line 381: error: statement syntax
as: "strings.s", line 382: error: unknown opcode "movb"
as: "strings.s", line 382: error: unknown "%"-symbol
as: "strings.s", line 382: error: unknown "%"-symbol
as: "strings.s", line 382: error: statement syntax
as: "strings.s", line 383: error: unknown opcode "movsb"
as: "strings.s", line 383: error: statement syntax
as: "strings.s", line 384: error: unknown opcode "andb"
as: "strings.s", line 384: error: unknown "%"-symbol
as: "strings.s", line 384: error: unknown "%"-symbol
as: "strings.s", line 384: error: statement syntax
as: "strings.s", line 385: error: unknown opcode "jnz"
as: "strings.s", line 385: error: statement syntax
as: "strings.s", line 386: error: unknown "%"-symbol
as: "strings.s", line 386: error: unknown "%"-symbol
as: "strings.s", line 386: error: statement syntax
as: "strings.s", line 387: error: unknown "%"-symbol
as: "strings.s", line 387: error: statement syntax
as: "strings.s", line 388: error: unknown "%"-symbol
as: "strings.s", line 388: error: unknown "%"-symbol
as: "strings.s", line 388: error: statement syntax
as: "strings.s", line 389: error: unknown "%"-symbol
as: "strings.s", line 389: error: unknown "%"-symbol
as: "strings.s", line 389: error: statement syntax
as: "strings.s", line 395: error: invalid character (0x40)
as: "strings.s", line 397: error: unknown "%"-symbol
as: "strings.s", line 397: error: unknown "%"-symbol
as: "strings.s", line 397: error: unknown "%"-symbol
as: "strings.s", line 397: error: unknown "%"-symbol
as: "strings.s", line 397: error: unknown "%"-symbol
as: "strings.s", line 397: error: statement syntax
as: "strings.s", line 398: error: unknown "%"-symbol
as: "strings.s", line 398: error: unknown "%"-symbol
as: "strings.s", line 398: error: statement syntax
as: "strings.s", line 399: error: unknown opcode "push"
as: "strings.s", line 399: error: unknown "%"-symbol
as: "strings.s", line 399: error: statement syntax
as: "strings.s", line 400: error: unknown opcode "leal"
as: "strings.s", line 400: error: unknown "%"-symbol
as: "strings.s", line 400: error: unknown "%"-symbol
as: "strings.s", line 400: error: statement syntax
as: "strings.s", line 401: error: unknown "%"-symbol
as: "strings.s", line 401: error: unknown "%"-symbol
as: "strings.s", line 401: error: statement syntax
as: "strings.s", line 402: error: unknown opcode "xorb"
as: "strings.s", line 402: error: unknown "%"-symbol
as: "strings.s", line 402: error: unknown "%"-symbol
as: "strings.s", line 402: error: statement syntax
as: "strings.s", line 403: warning: questionable use of relocatable value
as: "strings.s", line 403: error: statement syntax
as: "strings.s", line 406: error: unknown opcode "movsb"
as: "strings.s", line 406: error: statement syntax
as: "strings.s", line 407: error: unknown opcode "cmpb"
as: "strings.s", line 407: error: unknown "%"-symbol
as: "strings.s", line 407: error: unknown "%"-symbol
as: "strings.s", line 407: error: statement syntax
as: "strings.s", line 408: error: unknown opcode "jne"
as: "strings.s", line 408: error: statement syntax
as: "strings.s", line 409: error: unknown opcode "decl"
as: "strings.s", line 409: error: unknown "%"-symbol
as: "strings.s", line 409: error: unterminated string
as: "strings.s", line 409: error: statement syntax
as: "strings.s", line 412: error: unknown opcode "addl"
as: "strings.s", line 412: error: unknown "%"-symbol
as: "strings.s", line 412: error: statement syntax
as: "strings.s", line 413: error: unknown "%"-symbol
as: "strings.s", line 413: error: unknown "%"-symbol
as: "strings.s", line 413: error: statement syntax
as: "strings.s", line 414: error: unknown opcode "orl"
as: "strings.s", line 414: error: unknown "%"-symbol
as: "strings.s", line 414: error: unknown "%"-symbol
as: "strings.s", line 414: error: statement syntax
as: "strings.s", line 415: error: unknown opcode "jne"
as: "strings.s", line 415: error: statement syntax
as: "strings.s", line 416: error: unknown opcode "movb"
as: "strings.s", line 416: error: unknown "%"-symbol
as: "strings.s", line 416: error: unknown "%"-symbol
as: "strings.s", line 416: error: statement syntax
as: "strings.s", line 418: error: unknown "%"-symbol
as: "strings.s", line 418: error: unknown "%"-symbol
as: "strings.s", line 418: error: statement syntax
as: "strings.s", line 419: error: unknown opcode "pop"
as: "strings.s", line 419: error: unknown "%"-symbol
as: "strings.s", line 419: error: statement syntax
as: "strings.s", line 420: error: unknown "%"-symbol
as: "strings.s", line 420: error: unknown "%"-symbol
as: "strings.s", line 420: error: statement syntax
as: "strings.s", line 421: error: unknown "%"-symbol
as: "strings.s", line 421: error: unknown "%"-symbol
as: "strings.s", line 421: error: statement syntax
as: "strings.s", line 40: warning: label in delay slot (follows CTI)
as: "strings.s", line 50: warning: label in delay slot (follows CTI)
as: "strings.s", line 104: warning: label in delay slot (follows CTI)
as: "strings.s", line 115: warning: label in delay slot (follows CTI)
as: "strings.s", line 137: warning: label in delay slot (follows CTI)
as: "strings.s", line 148: warning: label in delay slot (follows CTI)
as: "strings.s", line 195: warning: label in delay slot (follows CTI)
as: "strings.s", line 207: warning: label in delay slot (follows CTI)
as: "strings.s", line 213: warning: label in delay slot (follows CTI)
as: "strings.s", line 244: warning: label in delay slot (follows CTI)
as: "strings.s", line 255: warning: label in delay slot (follows CTI)
as: "strings.s", line 309: warning: label in delay slot (follows CTI)
as: "strings.s", line 343: warning: label in delay slot (follows CTI)
as: "strings.s", line 352: warning: label in delay slot (follows CTI)
as: "strings.s", line 361: warning: label in delay slot (follows CTI)
as: "strings.s", line 366: warning: label in delay slot (follows CTI)
as: "strings.s", line 391: warning: label in delay slot (follows CTI)
as: "strings.s", line 396: warning: label in delay slot (follows CTI)
as: "strings.s", line 423: warning: label in delay slot (follows CTI)
as: "strings.s", line 424: warning: last CTI in segment has empty delay slot
as: "strings.s", line 424: error: can't compute value of an expression involving an
external symbol
as: "strings.s", line 278: error: expression must evaluate to a nonrelocatable (absolute)
value
as: "strings.s", line 403: error: expression must evaluate to a nonrelocatable (absolute)
value
make[2]: *** [strings.o] Error 1
make[2]: Leaving directory `/users/mbj/installs/mysql-3.22.20a/strings'
make[1]: *** [all-recursive] Error 1
make[1]: Leaving directory `/users/mbj/installs/mysql-3.22.20a'
make: *** [all-recursive-am] Error 2
# 


-- 
Martin B. Jespersen
Technical Project Leader
Icon Medialab A/S (http://www.IconMedialab.dk)

E-Mail: Martin@stripped
Mail:   Havnegade 39, DK-1058 Copenhagen K
Voice:  (+45) 7023-1001
Fax:    (+45) 33320209
Thread
More compile errors on solaris 2.6 with mysql 3.22.20aMartin B. Jespersen19 Mar
  • More compile errors on solaris 2.6 with mysql 3.22.20aMichael Widenius19 Mar