List:General Discussion« Previous MessageNext Message »
From:Paul DuBois Date:June 2 1999 4:40pm
Subject:Re: Compilation errors...?
View as plain text  
At 10:58 AM -0500 6/2/99, Paul Key wrote:
>Solaris 7
>mysql-3.22.22
>egcs-2.91.66
>
>Can anyone suggest a way around the following complitaion
>(make) errors?
>
>Thanks
>
>Paul
>
>make[2]: Entering directory `/export/home/imp/mysql-3.22.22/client'
>c++ -DUNDEF_THREADS_HACK -I./../include -I../include -I./.. -I.. -I..  -O
>-fno
>-implicit-templates -DDBUG_OFF -D_LARGEFILE_SOURCE -D_FILE_OFFSET_BITS=64
>-c mys
>ql.cc
>In file included from mysql.cc:54:
>/usr/include/term.h:1060: syntax error before `,'
>/usr/include/term.h:1081: syntax error before `;'
>/usr/include/term.h:1082: syntax error before `;'
>/usr/include/term.h:1101: syntax error before `['
>/usr/include/term.h:1108: syntax error before `*'
>/usr/include/term.h:1111: syntax error before `;'
>/usr/include/term.h:1115: syntax error before `;'
>/usr/include/term.h:1116: syntax error before `;'
>/usr/include/term.h:1209: `chtype' was not declared in this scope
>/usr/include/term.h:1209: parse error before `('
>make[2]: *** [mysql.o] Error 1
>make[2]: Leaving directory `/export/home/imp/mysql-3.22.22/client'
>make[1]: *** [all-recursive] Error 1
>make[1]: Leaving directory `/export/home/imp/mysql-3.22.22'
>make: *** [all-recursive-am] Error 2

This is in the Solaris notes section of the installation chapter
of the MySQL manual.  See:

http://www.mysql.com/Manual_chapter/manual_Installing.html#Solaris_2.7

--
Paul DuBois, paul@stripped
Northern League Chronicles: http://www.snake.net/nl/
Thread
Compilation errors...?Paul Key2 Jun
  • Re: Compilation errors...?Paul DuBois2 Jun