List:General Discussion« Previous MessageNext Message »
From:System Administrator a.k.a. The Root of the Problem Date:March 8 2000 4:27pm
Subject:Mysql Perl module problems
View as plain text  
How do I remedy this?


Script started on Wed Mar  8 09:24:37 2000
doctor.nl2k.ab.ca//usr/source/Msql-Mysql-modules-1.2210$ xtelnet localhost
25xmake && make tesdt\\    t
PERL_DL_NONLAZY=1 /usr/bin/perl -I../blib/arch -I../blib/lib
-I/usr/libdata/perl5/5.00503/i386-bsdos -I/usr/libdata/perl5/5.00503 -e 'use
Test::Harness qw(&runtests $verbose); $verbose=0; runtests @ARGV;' t/*.t
t/00base............ok
t/10dsnlist.........DBI->connect failed: Access denied for user: 'root@localhost'
(Using password: NO) at t/10dsnlist.t line 45
Cannot connect: Access denied for user: 'root@localhost' (Using password: NO)
        Either your server is not up and running or you have no
        permissions for acessing the DSN DBI:mysql:database=test.
        This test requires a running server and write permissions.
        Please make sure your server is running and you have
        permissions, then retry.
dubious
        Test returned status 10 (wstat 2560, 0xa00)
DIED. FAILED tests 1-3
        Failed 3/3 tests, 0.00% okay
t/20createdrop......DBI->connect failed: Access denied for user: 'root@localhost'
(Using password: NO) at t/20createdrop.t line 47
Cannot connect: Access denied for user: 'root@localhost' (Using password: NO)
        Either your server is not up and running or you have no
        permissions for acessing the DSN DBI:mysql:database=test.
        This test requires a running server and write permissions.
        Please make sure your server is running and you have
        permissions, then retry.
dubious
        Test returned status 10 (wstat 2560, 0xa00)
DIED. FAILED tests 1-5
        Failed 5/5 tests, 0.00% okay
t/30insertfetch.....DBI->connect failed: Access denied for user: 'root@localhost'
(Using password: NO) at t/30insertfetch.t line 48
Cannot connect: Access denied for user: 'root@localhost' (Using password: NO)
        Either your server is not up and running or you have no
        permissions for acessing the DSN DBI:mysql:database=test.
        This test requires a running server and write permissions.
        Please make sure your server is running and you have
        permissions, then retry.
dubious
        Test returned status 10 (wstat 2560, 0xa00)
DIED. FAILED tests 1-11
        Failed 11/11 tests, 0.00% okay
t/40bindparam.......DBI->connect failed: Access denied for user: 'root@localhost'
(Using password: NO) at t/40bindparam.t line 64
Cannot connect: Access denied for user: 'root@localhost' (Using password: NO)
        Either your server is not up and running or you have no
        permissions for acessing the DSN DBI:mysql:database=test.
        This test requires a running server and write permissions.
        Please make sure your server is running and you have
        permissions, then retry.
dubious
        Test returned status 10 (wstat 2560, 0xa00)
DIED. FAILED tests 1-28
        Failed 28/28 tests, 0.00% okay
t/40blobs...........DBI->connect failed: Access denied for user: 'root@localhost'
(Using password: NO) at t/40blobs.t line 68
Cannot connect: Access denied for user: 'root@localhost' (Using password: NO)
        Either your server is not up and running or you have no
        permissions for acessing the DSN DBI:mysql:database=test.
        This test requires a running server and write permissions.
        Please make sure your server is running and you have
        permissions, then retry.
dubious
        Test returned status 10 (wstat 2560, 0xa00)
DIED. FAILED tests 1-11
        Failed 11/11 tests, 0.00% okay
t/40listfields......DBI->connect failed: Access denied for user: 'root@localhost'
(Using password: NO) at t/40listfields.t line 57
Cannot connect: Access denied for user: 'root@localhost' (Using password: NO)
        Either your server is not up and running or you have no
        permissions for acessing the DSN DBI:mysql:database=test.
        This test requires a running server and write permissions.
        Please make sure your server is running and you have
        permissions, then retry.
dubious
        Test returned status 10 (wstat 2560, 0xa00)
DIED. FAILED tests 1-16
        Failed 16/16 tests, 0.00% okay
t/40nulls...........DBI->connect failed: Access denied for user: 'root@localhost'
(Using password: NO) at t/40nulls.t line 50
Cannot connect: Access denied for user: 'root@localhost' (Using password: NO)
        Either your server is not up and running or you have no
        permissions for acessing the DSN DBI:mysql:database=test.
        This test requires a running server and write permissions.
        Please make sure your server is running and you have
        permissions, then retry.
dubious
        Test returned status 10 (wstat 2560, 0xa00)
DIED. FAILED tests 1-11
        Failed 11/11 tests, 0.00% okay
t/40numrows.........DBI->connect failed: Access denied for user: 'root@localhost'
(Using password: NO) at t/40numrows.t line 59
Cannot connect: Access denied for user: 'root@localhost' (Using password: NO)
        Either your server is not up and running or you have no
        permissions for acessing the DSN DBI:mysql:database=test.
        This test requires a running server and write permissions.
        Please make sure your server is running and you have
        permissions, then retry.
dubious
        Test returned status 10 (wstat 2560, 0xa00)
DIED. FAILED tests 1-25
        Failed 25/25 tests, 0.00% okay
t/50chopblanks......DBI->connect failed: Access denied for user: 'root@localhost'
(Using password: NO) at t/50chopblanks.t line 57
Cannot connect: Access denied for user: 'root@localhost' (Using password: NO)
        Either your server is not up and running or you have no
        permissions for acessing the DSN DBI:mysql:database=test.
        This test requires a running server and write permissions.
        Please make sure your server is running and you have
        permissions, then retry.
dubious
        Test returned status 10 (wstat 2560, 0xa00)
DIED. FAILED tests 1-35
        Failed 35/35 tests, 0.00% okay
t/50commit..........DBI->connect failed: Access denied for user: 'root@localhost'
(Using password: NO) at t/50commit.t line 64
Can't call method "func" on an undefined value at ../tests/mysql.dbtest line 96.
dubious
        Test returned status 255 (wstat 65280, 0xff00)
DIED. FAILED tests 1-16
        Failed 16/16 tests, 0.00% okay
t/60leaks...........skipping test on this platform
t/ak-dbd............DBI->connect failed: Access denied for user: 'root@localhost'
(Using password: NO) at t/ak-dbd.t line 59
Can't call method "func" on an undefined value at ../tests/mysql.dbtest line 96.
dubious
        Test returned status 255 (wstat 65280, 0xff00)
DIED. FAILED tests 1, 4-90
        Failed 88/90 tests, 2.22% okay
t/dbdadmin..........DBI->connect failed: Access denied for user: 'root@localhost'
(Using password: NO) at t/dbdadmin.t line 60
Cannot connect: Access denied for user: 'root@localhost' (Using password: NO)
        Either your server is not up and running or you have no
        permissions for acessing the DSN DBI:mysql:database=test.
        This test requires a running server and write permissions.
        Please make sure your server is running and you have
        permissions, then retry.
dubious
        Test returned status 10 (wstat 2560, 0xa00)
DIED. FAILED tests 1-20
        Failed 20/20 tests, 0.00% okay
Failed Test  Status Wstat Total Fail  Failed  List of failed
-------------------------------------------------------------------------------
t/10dsnlist.t    10  2560     3    3 100.00%  1-3
t/20createdrop.  10  2560     5    5 100.00%  1-5
t/30insertfetch  10  2560    11   11 100.00%  1-11
t/40bindparam.t  10  2560    28   28 100.00%  1-28
t/40blobs.t      10  2560    11   11 100.00%  1-11
t/40listfields.  10  2560    16   16 100.00%  1-16
t/40nulls.t      10  2560    11   11 100.00%  1-11
t/40numrows.t    10  2560    25   25 100.00%  1-25
t/50chopblanks.  10  2560    35   35 100.00%  1-35
t/50commit.t    255 65280    16   16 100.00%  1-16
t/ak-dbd.t      255 65280    90   88  97.78%  1, 4-90
t/dbdadmin.t     10  2560    20   20 100.00%  1-20
1 test skipped.
Failed 12/14 test scripts, 14.29% okay. 269/276 subtests failed, 2.54% okay.
*** Error code 2

Stop.
*** Error code 1

Stop.
doctor.nl2k.ab.ca//usr/source/Msql-Mysql-modules-1.2210$ exit
exit

Script done on Wed Mar  8 09:25:03 2000
Thread
Mysql Perl module problemsSystem Administrator a.k.a. The Root of the Problem8 Mar
  • Re: Mysql Perl module problemssinisa8 Mar
    • Re: Mysql Perl module problemsSystem Administrator a.k.a. The Root of the Problem9 Mar
      • Re: Mysql Perl module problemssinisa9 Mar
        • Re: Mysql Perl module problemsSystem Administrator a.k.a. The Root of the Problem10 Mar
          • Re: Mysql Perl module problemsSystem Administrator a.k.a. The Root of the Problem10 Mar
            • Re: Mysql Perl module problemsThimble Smith10 Mar
              • Re: Mysql Perl module problemsSystem Administrator a.k.a. The Root of the Problem10 Mar