List:General Discussion« Previous MessageNext Message »
From:Chris Trown Date:May 5 1999 4:22pm
Subject:Re: Compile problems with HP/UX 10.20
View as plain text  
On Wed, May 05, 1999 at 11:15:48AM +0200, Jens Ellegiers scribbled:
> Hi,
> 
> I'm new to the list, but I have been searching the list archive before
> asking this question and didn't find anyone having similar problems.
> 
> When compiling on HP Visualize C180 with the following output of uname
> -a:
> 
> HP-UX ... B.10.20 A 9000/780 ...
> 
> with GNU make version 3.77 and the compiler version 
> 
> egcs-2.91.66
> 
> I'm getting the following error when compiling:
> 
> c++ -DMYSQL_SERVER
>
> -DDEFAULT_MYSQL_HOME="\"/ford/deng206/users/jellegie/KURBELWELLE/PROGRAMM/crank_tools/database\""
>
> -DDATADIR="\"/ford/deng206/users/jellegie/KURBELWELLE/PROGRAMM/crank_tools/database/var\""
>
> -DSHAREDIR="\"/ford/deng206/users/jellegie/KURBELWELLE/PROGRAMM/crank_tools/database/share/mysql\""
> -DHAVE_CONFIG_H -I../mit-pthreads/include -I./../include -I./../regex
> -I. -I../include -I.. -I.  -O   -fno-implicit-templates -DDBUG_OFF  -c
> sql_yacc.cc
> insn-output.c:1323: Internal compiler error in function output_234
> make[2]: *** [sql_yacc.o] Error 1
> make[2]: Leaving directory
> `/export/ford/deng206/u/jellegie/SOFTWARE/mysql-3.22.22/sql'
> make[1]: *** [all-recursive] Error 1
> make[1]: Leaving directory
> `/export/ford/deng206/u/jellegie/SOFTWARE/mysql-3.22.22'
> make: *** [all-recursive-am] Error 2
> 
> Can anyone of you tell me of a solution to this problem?
> 

     I didn't run into that one.  But I would definately report this bug to the 
egcs crew.  Those types of errors just should not happen.

     Hrmm...  Are you using GAS?

Chris...

-- 
What's the point?

An NT server can be run by an idiot, and usually is.
PGP fingerprint: 063FCE320681C336  78C164FC9B2F91EA
Thread
Compile problems with HP/UX 10.20Jens Ellegiers5 May
  • Re: Compile problems with HP/UX 10.20Chris Trown5 May
  • Re: Compile problems with HP/UX 10.20Jens Ellegiers10 May
    • Re: Compile problems with egcs 1.1.2Chris Trown10 May
  • Re: Compile problems with egcs 1.1.2Jens Ellegiers11 May