List:General Discussion« Previous MessageNext Message »
From:Paul DuBois Date:January 11 2000 2:14am
Subject:Re: Please! Can you help me..?
View as plain text  
At 10:54 AM +0900 2000-01-11, =?EUC-KR?B?v/jB1sjx?= wrote:
>Hello?
>My name is nea.
>And I'm Korean.
>So I can't english very well.
>
>I installed mysql on my workstation (Its OS is Solaris2.7)
>But when I run make, get error of the following.
>
>-----------------------------------------------------------------------
>creating libmysqlclient.la
>(cd .libs && rm -f libmysqlclient.la && ln -s ../libmysqlclient.la
>libmysqlclient.la)
>c++ -DUNDEF_THREADS_HACK -I./../include
>-I../include                            -I./.. -I.. -I..
>-fno-implicit-templc
>In file included from mysql.cc:54:
>/usr/include/term.h:1060: syntax error before `,'
>/usr/include/term.h:1081: syntax error before `;'
>/usr/include/term.h:1082: syntax error before `;'
>/usr/include/term.h:1101: syntax error before `['
>/usr/include/term.h:1108: syntax error before `*'
>/usr/include/term.h:1111: syntax error before `;'
>/usr/include/term.h:1115: syntax error before `;'
>/usr/include/term.h:1116: syntax error before `;'
>/usr/include/term.h:1209: `chtype' was not declared in this scope
>/usr/include/term.h:1209: parse error before `('
>gmake[2]: *** [mysql.o] Error 1
>gmake[2]: Leaving directory
>`/user/center/haremoon/down/mysql-3.22.26a/client'
>gmake[1]: *** [all-recursive] Error 1
>gmake[1]: Leaving directory `/user/center/haremoon/down/mysql-3.22.26a'
>gmake: *** [all-recursive-am] Error 2
>------------------------------------------------------------------------------
>
>I can't understand that error and I don't know.
>Please How can I do...?


Read the Solaris notes section in chapter 4 of the MySQL reference
manual, which describes the problem (broken Solaris include file) and
how to fix it.

-- 
Paul DuBois, paul@stripped
Thread
Please! Can you help me..?원주희11 Jan
  • Re: Please! Can you help me..?Paul DuBois11 Jan