List:General Discussion« Previous MessageNext Message »
From:gaspard Date:April 16 1999 10:48am
Subject:compilation problem
View as plain text  
 



I have to compile mysql-3.22.21 successfully  with the sources on linux
2.0.34 (slackware)
very simple, juste ./configure ; make ; make install
all functions perfectly 


and I want to install mysql on another station with the same configuration,
 but compilation fails. 

then I try to remake the same operation on the first station and 
compilation fails.

I am surprised by this error whereas all had to go perfectly the first
time.

...................

cc1plus: warnings being treated as errors
include/pthread/sleep.h: In function `int machdep_gettimeofday(struct
timespec *)':
In file included from include/pthread.h:54,
                 from
/ext2/usr/local/src/mysql-3.22.21/mit-pthreads/pthreads/init.cc:7:
include/pthread/sleep.h:52: warning: ANSI C++ forbids implicit conversion
from `void *' in argument passing
make[2]: *** [obj/init.o] Error 1
make[2]: Leaving directory `/ext2/usr/local/src/mysql-3.22.21/mit-pthreads'
make[1]: *** [all-recursive] Error 1
make[1]: Leaving directory `/ext2/usr/local/src/mysql-3.22.21'
make: *** [all-recursive-am] Error 2


.............


thanks for your assistance

---
 Alain Gaspard 
mailto:alain@stripped 
http://www.gaspard.net
ICQ # 4776135    IRC _AG_
Thread
compilation problemgaspard16 Apr
  • compilation problemMichael Widenius17 Apr