List:General Discussion« Previous MessageNext Message »
From:Michael Widenius Date:November 16 1999 1:02pm
Subject:Unresolved: fflush abort
View as plain text  
>>>>> "Francois" == Francois Donze <donze@stripped> writes:

Francois> Hi,
Francois> I am in the process of installing/compiling mysql-3.22.27 onto Tru64 UNIX
> V4.0F 9 (Rev 1229). ./configure is fine, but compiling fails during the link process
Francois> with the following error:

Francois> gcc -D_LARGEFILE_SOURCE -D_LARGEFILE64_SOURCE -D_FILE_OFFSET_BITS=64 -O6
> -DDBUG_OFF -I./include -o re split.o debug.o main.o libregex.a
Francois> ../strings/libmystrings.a -lm -lpthread -lmach -lexc -lc
Francois> collect2: ld returned 1 exit status
Francois> /usr/bin/ld:
Francois> Unresolved:
Francois> fflush
Francois> abort
Francois> gmake[2]: *** [re] Error 1
Francois> gmake[2]: Leaving directory `/usr/users/kits/mysql/mysql-3.22.27/regex'
Francois> gmake[1]: *** [all-recursive] Error 1
Francois> gmake[1]: Leaving directory `/usr/users/kits/mysql/mysql-3.22.27'
Francois> gmake: *** [all-recursive-am] Error 2

Fix:

Try MySQL 3.23.6 instead.  (or remove the -lc from the above link line)

Regards,
Monty
Thread
Unresolved: fflush abortFrancois Donze28 Oct
  • Unresolved: fflush abortMichael Widenius18 Nov