List:General Discussion« Previous MessageNext Message »
From:Paul DuBois Date:October 23 2002 6:23pm
Subject:Re: Error when compiling mysql 3.23.53 on Solaris 9
View as plain text  
At 11:13 -0700 10/23/02, Jeremy Lau wrote:
>Hi all,
>
>I am compiling mysql 3.23.53 on Solaris 9 using gcc
>3.2.
>
>Any clue to the following errors:
>
>mkdir .libs
>g++ -O3 -DDBUG_OFF -fno-implicit-templates
>-fno-exceptions -fno-rtti -DHAVE_RWLOCK_T -o
>gen_lex_hash gen_lex_hash.o ../isam/libnisam.a
>../merge/libmerge.a ../myisam/libmyisam.a
>../myisammrg/libmyisammrg.a ../heap/libheap.a
>../mysys/libmysys.a ../dbug/libdbug.a
>../regex/libregex.a ../strings/libmystrings.a
>-lpthread -lthread -lz -lcrypt -lgen -lsocket -lnsl
>-lm -lpthread -lthread
>make[4]: Leaving directory `/pub/mysql-3.23.53/sql'
>./gen_lex_hash > lex_hash.h
>ld.so.1: ./gen_lex_hash: fatal: libstdc++.so.5: open
>failed: No such file or directory

Set LD_LIBRARY_PATH to include the directory where libstdc++.so
is located.

>Killed
>make[3]: *** [lex_hash.h] Error 137
>make[3]: Leaving directory `/pub/mysql-3.23.53/sql'
>make[2]: *** [all-recursive] Error 1
>make[2]: Leaving directory `/pub/mysql-3.23.53/sql'
>make[1]: *** [all-recursive] Error 1
>make[1]: Leaving directory `/pub/mysql-3.23.53'
>make: *** [all-recursive-am] Error 2
>
>Thanks

Thread
Error when compiling mysql 3.23.53 on Solaris 9Jeremy Lau23 Oct
  • Re: Error when compiling mysql 3.23.53 on Solaris 9Paul DuBois23 Oct
  • Re: Error when compiling mysql 3.23.53 on Solaris 9Lou Picciano23 Oct